Reaction Details
TargetCytochrome P450 2C8
LigandBDBM50134931
Substrate/Competitorn/a
Meas. Tech.ChEMBL_494881 (CHEMBL949431)
IC50 13000±n/a nM
Citation O'Neill, PMPark, BKShone, AEMaggs, JLRoberts, PStocks, PABiagini, GABray, PGGibbons, PBerry, NWinstanley, PAMukhtar, ABonar-Law, RHindley, SBambal, RBDavis, CBBates, MHart, TKGresham, SLLawrence, RMBrigandi, RAGomez-delas-Heras, FMGargallo, DVWard, SA Candidate selection and preclinical evaluation of N-tert-butyl isoquine (GSK369796), an affordable and effective 4-aminoquinoline antimalarial for the 21st century. J Med Chem52:1408-15 (2010) 
 
Cytochrome P450 2C8
Name:Cytochrome P450 2C8
Type:Protein
Mol. Mass.:55839.23
Organism:Homo sapiens (Human)
Description:P10632
Residue:490
BDBM50134931
NameBDBM50134931
Synonyms:5-(7-Chloro-quinolin-4-ylamino)-2-diethylaminomethyl-phenol CHEMBL147587 | isoquine
TypeSmall organic molecule
Emp. Form.C20H22ClN3O
Mol. Mass.355.861
SMILESCCN(CC)Cc1ccc(Nc2ccnc3cc(Cl)ccc23)cc1O