Reaction Details
TargetHistamine H3 receptor
LigandBDBM50293192
Substrate/Competitorn/a
Meas. Tech.ChEMBL_497215 (CHEMBL1003672)
Ki 37±n/a nM
Citation Letavic, MAKeith, JMLy, KSBonaventure, PFeinstein, MALord, BMiller, KLMotley, STNepomuceno, DSutton, SWCarruthers, NI 2-Aryloxymethylmorpholine histamine H(3) antagonists. Bioorg Med Chem Lett18:5796-9 (2009) 
 
Histamine H3 receptor
Name:Histamine H3 receptor
Type:G Protein-Coupled Receptor (GPCR)
Mol. Mass.:48691.47
Organism:Homo sapiens (Human)
Description:Binding assays were using CHO cells stably expressing hH3R receptors.
Residue:445
BDBM50293192
NameBDBM50293192
Synonyms:4-cyclobutyl-2-((3-(morpholinomethyl)phenoxy)methyl)morpholine | CHEMBL495744
TypeSmall organic molecule
Emp. Form.C20H30N2O3
Mol. Mass.346.4638
SMILESC(Oc1cccc(CN2CCOCC2)c1)C1CN(CCO1)C1CCC1