Reaction Details
TargetHistamine H3 receptor
LigandBDBM50293195
Substrate/Competitorn/a
Meas. Tech.ChEMBL_497215 (CHEMBL1003672)
Ki 9000±n/a nM
Citation Letavic, MAKeith, JMLy, KSBonaventure, PFeinstein, MALord, BMiller, KLMotley, STNepomuceno, DSutton, SWCarruthers, NI 2-Aryloxymethylmorpholine histamine H(3) antagonists. Bioorg Med Chem Lett18:5796-9 (2009) 
 
Histamine H3 receptor
Name:Histamine H3 receptor
Type:G Protein-Coupled Receptor (GPCR)
Mol. Mass.:48691.47
Organism:Homo sapiens (Human)
Description:Binding assays were using CHO cells stably expressing hH3R receptors.
Residue:445
BDBM50293195
NameBDBM50293195
Synonyms:2-((2-ethoxyphenoxy)methyl)-4-isopropylmorpholine | CHEMBL495543
TypeSmall organic molecule
Emp. Form.C16H25NO3
Mol. Mass.279.3746
SMILESCCOc1ccccc1OCC1CN(CCO1)C(C)C