Reaction Details
TargetHistamine H3 receptor
LigandBDBM50293196
Substrate/Competitorn/a
Meas. Tech.ChEMBL_497215 (CHEMBL1003672)
Ki 7100±n/a nM
Citation Letavic, MAKeith, JMLy, KSBonaventure, PFeinstein, MALord, BMiller, KLMotley, STNepomuceno, DSutton, SWCarruthers, NI 2-Aryloxymethylmorpholine histamine H(3) antagonists. Bioorg Med Chem Lett18:5796-9 (2009) 
 
Histamine H3 receptor
Name:Histamine H3 receptor
Type:G Protein-Coupled Receptor (GPCR)
Mol. Mass.:48691.47
Organism:Homo sapiens (Human)
Description:Binding assays were using CHO cells stably expressing hH3R receptors.
Residue:445
BDBM50293196
NameBDBM50293196
Synonyms:4-cyclobutyl-2-((2-ethoxyphenoxy)methyl)morpholine | CHEMBL496361
TypeSmall organic molecule
Emp. Form.C17H25NO3
Mol. Mass.291.3853
SMILESCCOc1ccccc1OCC1CN(CCO1)C1CCC1