Reaction Details
TargetSerine/threonine-protein kinase Sgk1
LigandBDBM50296010
Substrate/Competitorn/a
Meas. Tech.ChEMBL_579226 (CHEMBL1058020)
IC50 5±n/a nM
Citation Hammond, MWashburn, DGHoang, HTManns, SFrazee, JSNakamura, HPatterson, JRTrizna, WWu, CAzzarano, LMNagilla, RNord, MTrejo, RHead, MSZhao, BSmallwood, AMHightower, KLaping, NJSchnackenberg, CGThompson, SK Design and synthesis of orally bioavailable serum and glucocorticoid-regulated kinase 1 (SGK1) inhibitors. Bioorg Med Chem Lett19:4441-5 (2009) 
 
Serine/threonine-protein kinase Sgk1
Name:Serine/threonine-protein kinase Sgk1
Type:Other Protein Type
Mol. Mass.:48954.40
Organism:Homo sapiens (Human)
Description:Recombinant human SGK-1 enzyme produced in a baculovirus system.
Residue:431
BDBM50296010
NameBDBM50296010
Synonyms:2-isobutyl-4-(5-phenyl-1H-pyrrolo[2,3-b]pyridin-3-yl)benzoic acid | CHEMBL564555
TypeSmall organic molecule
Emp. Form.C24H22N2O2
Mol. Mass.370.4437
SMILESCC(C)Cc1cc(ccc1C(O)=O)-c1c[nH]c2ncc(cc12)-c1ccccc1