Reaction Details
TargetProstaglandin E2 receptor EP3 subtype
LigandBDBM50414529
Substrate/Competitorn/a
Meas. Tech.ChEMBL_581537 (CHEMBL1059840)
Ki 158.49±n/a nM
Citation Hilfiker, MAWang, NHou, XDu, ZPullen, MANord, MNagilla, RFries, HEWu, CWSulpizio, ACJaworski, JPMorrow, DEdwards, RMJin, J Discovery of novel aminothiadiazole amides as selective EP(3) receptor antagonists. Bioorg Med Chem Lett19:4292-5 (2009) 
 
Prostaglandin E2 receptor EP3 subtype
Name:Prostaglandin E2 receptor EP3 subtype
Type:Enzyme
Mol. Mass.:43335.03
Organism:Homo sapiens (Human)
Description:P43115
Residue:390
BDBM50414529
NameBDBM50414529
Synonyms:CHEMBL564305
TypeSmall organic molecule
Emp. Form.C15H17N3O3S
Mol. Mass.319.379
SMILESCC(C)(C)c1nnc(NC(=O)c2ccc3OCCOc3c2)s1