Reaction Details
TargetProstaglandin E2 receptor EP3 subtype
LigandBDBM50414541
Substrate/Competitorn/a
Meas. Tech.ChEMBL_581537 (CHEMBL1059840)
Ki 200±n/a nM
Citation Hilfiker, MAWang, NHou, XDu, ZPullen, MANord, MNagilla, RFries, HEWu, CWSulpizio, ACJaworski, JPMorrow, DEdwards, RMJin, J Discovery of novel aminothiadiazole amides as selective EP(3) receptor antagonists. Bioorg Med Chem Lett19:4292-5 (2009) 
 
Prostaglandin E2 receptor EP3 subtype
Name:Prostaglandin E2 receptor EP3 subtype
Type:Enzyme
Mol. Mass.:43335.03
Organism:Homo sapiens (Human)
Description:P43115
Residue:390
BDBM50414541
NameBDBM50414541
Synonyms:CHEMBL562132
TypeSmall organic molecule
Emp. Form.C20H19N3O3S
Mol. Mass.381.448
SMILESCc1cccc(C)c1-c1nnc(NC(=O)c2ccc3OCCCOc3c2)s1