Reaction Details
TargetProstaglandin E2 receptor EP3 subtype
LigandBDBM50414549
Substrate/Competitorn/a
Meas. Tech.ChEMBL_581546 (CHEMBL1060745)
Ki 6.31±n/a nM
Citation Hilfiker, MAWang, NHou, XDu, ZPullen, MANord, MNagilla, RFries, HEWu, CWSulpizio, ACJaworski, JPMorrow, DEdwards, RMJin, J Discovery of novel aminothiadiazole amides as selective EP(3) receptor antagonists. Bioorg Med Chem Lett19:4292-5 (2009) 
 
Prostaglandin E2 receptor EP3 subtype
Name:Prostaglandin E2 receptor EP3 subtype
Type:Enzyme Catalytic Domain
Mol. Mass.:39958.37
Organism:RAT
Description:Prostaglandin E2 PTGER2 RAT::P34980
Residue:365
BDBM50414549
NameBDBM50414549
Synonyms:CHEMBL563480
TypeSmall organic molecule
Emp. Form.C19H16Cl2N4O2S
Mol. Mass.435.327
SMILESCCN1CCOc2ccc(cc12)C(=O)Nc1nnc(s1)-c1c(Cl)cccc1Cl