Reaction Details
TargetProstaglandin D2 receptor 2
LigandBDBM50296979
Substrate/Competitorn/a
Meas. Tech.ChEMBL_580958 (CHEMBL1054923)
IC50 1±n/a nM
Citation Stearns, BABaccei, CBain, GBroadhead, AClark, RCCoate, HEvans, JFFagan, PHutchinson, JHKing, CLee, CLorrain, DSPrasit, PProdanovich, PSantini, AScott, JMStock, NSTruong, YP Novel tricyclic antagonists of the prostaglandin D2 receptor DP2 with efficacy in a murine model of allergic rhinitis. Bioorg Med Chem Lett19:4647-51 (2009) 
 
Prostaglandin D2 receptor 2
Name:Prostaglandin D2 receptor 2
Type:Enzyme
Mol. Mass.:43295.45
Organism:Homo sapiens (Human)
Description:Q9Y5Y4
Residue:395
BDBM50296979
NameBDBM50296979
Synonyms:2-((3R)-3-(4-fluoro-N-methylphenylsulfonamido)-3,4-dihydro-1H-carbazol-9(2H,4bH,8aH)-yl)acetic acid | CHEMBL563664
TypeSmall organic molecule
Emp. Form.C21H23FN2O4S
Mol. Mass.418.482
SMILESCN([C@@H]1CCC2=C(C1)C1C=CC=CC1N2CC(O)=O)S(=O)(=O)c1ccc(F)cc1