Reaction Details
TargetProstaglandin D2 receptor
LigandBDBM50161746
Substrate/Competitorn/a
Meas. Tech.ChEMBL_580961 (CHEMBL1054926)
IC50 33400±n/a nM
Citation Stearns, BABaccei, CBain, GBroadhead, AClark, RCCoate, HEvans, JFFagan, PHutchinson, JHKing, CLee, CLorrain, DSPrasit, PProdanovich, PSantini, AScott, JMStock, NSTruong, YP Novel tricyclic antagonists of the prostaglandin D2 receptor DP2 with efficacy in a murine model of allergic rhinitis. Bioorg Med Chem Lett19:4647-51 (2009) 
 
Prostaglandin D2 receptor
Name:Prostaglandin D2 receptor
Type:Enzyme
Mol. Mass.:40288.87
Organism:Homo sapiens (Human)
Description:Q13258
Residue:359
BDBM50161746
NameBDBM50161746
Synonyms:(R)-3-(3-(4-fluorophenylsulfonamido)-1,2,3,4-tetrahydrocarbazol-9-yl)propanoic acid CHEMBL361812 | RAMATROBAN
TypeSmall organic molecule
Emp. Form.C21H21FN2O4S
Mol. Mass.416.466
SMILESOC(=O)CCn1c2CC[C@H](Cc2c2ccccc12)NS(=O)(=O)c1ccc(F)cc1