Reaction Details
TargetProstaglandin G/H synthase 2
LigandBDBM50297671
Substrate/Competitorn/a
Meas. Tech.ChEMBL_583889 (CHEMBL1059941)
IC50<1.4±n/a nM
Citation Swarbrick, MEBeswick, PJGleave, RJGreen, RHBingham, SBountra, CCarter, MCChambers, LJChessell, IPClayton, NMCollins, SDCorfield, JAHartley, CDKleanthous, SLambeth, PFLucas, FSMathews, NNaylor, APage, LWPayne, JJPegg, NAPrice, HSSkidmore, JStevens, AJStocker, RStratton, SCStuart, AJWiseman, JO Identification of [4-[4-(methylsulfonyl)phenyl]-6-(trifluoromethyl)-2-pyrimidinyl] amines and ethers as potent and selective cyclooxygenase-2 inhibitors. Bioorg Med Chem Lett19:4504-8 (2009) 
 
Prostaglandin G/H synthase 2
Name:Prostaglandin G/H synthase 2
Type:Enzyme
Mol. Mass.:69003.89
Organism:Homo sapiens (Human)
Description:Recombinant Cox-2 provided by Cayman (Cayman Chemical Co.,Ann Arbor, MI).
Residue:604
BDBM50297671
NameBDBM50297671
Synonyms:4-(2-(butylamino)-6-(trifluoromethyl)pyrimidin-4-yl)benzenesulfonamide | CHEMBL538418
TypeSmall organic molecule
Emp. Form.C15H17F3N4O2S
Mol. Mass.374.381
SMILESCCCCNc1nc(cc(n1)C(F)(F)F)-c1ccc(cc1)S(N)(=O)=O