Reaction Details
TargetProstaglandin G/H synthase 2
LigandBDBM50297679
Substrate/Competitorn/a
Meas. Tech.ChEMBL_583892 (CHEMBL1059944)
IC50 11±n/a nM
Citation Swarbrick, MEBeswick, PJGleave, RJGreen, RHBingham, SBountra, CCarter, MCChambers, LJChessell, IPClayton, NMCollins, SDCorfield, JAHartley, CDKleanthous, SLambeth, PFLucas, FSMathews, NNaylor, APage, LWPayne, JJPegg, NAPrice, HSSkidmore, JStevens, AJStocker, RStratton, SCStuart, AJWiseman, JO Identification of [4-[4-(methylsulfonyl)phenyl]-6-(trifluoromethyl)-2-pyrimidinyl] amines and ethers as potent and selective cyclooxygenase-2 inhibitors. Bioorg Med Chem Lett19:4504-8 (2009) 
 
Prostaglandin G/H synthase 2
Name:Prostaglandin G/H synthase 2
Type:Enzyme
Mol. Mass.:69003.89
Organism:Homo sapiens (Human)
Description:Recombinant Cox-2 provided by Cayman (Cayman Chemical Co.,Ann Arbor, MI).
Residue:604
BDBM50297679
NameBDBM50297679
Synonyms:4-(4-(methylsulfonyl)phenyl)-N-p-tolyl-6-(trifluoromethyl)pyrimidin-2-amine | CHEMBL560887
TypeSmall organic molecule
Emp. Form.C19H16F3N3O2S
Mol. Mass.407.409
SMILESCc1ccc(Nc2nc(cc(n2)C(F)(F)F)-c2ccc(cc2)S(C)(=O)=O)cc1