Reaction Details
TargetC-X-C chemokine receptor type 1
LigandBDBM50200887
Substrate/Competitorn/a
Meas. Tech.ChEMBL_584048 (CHEMBL1055928)
Ki 210±n/a nM
Citation Aki, CChao, JFerreira, JADwyer, MPYu, YChao, JMerritt, RJLai, GWu, MHipkin, RWFan, XGonsiorek, WFosseta, JRindgen, DFine, JLundell, DTaveras, AGBiju, P Diaminocyclobutenediones as potent and orally bioavailable CXCR2 receptor antagonists: SAR in the phenolic amide region. Bioorg Med Chem Lett19:4446-9 (2009) 
 
C-X-C chemokine receptor type 1
Name:C-X-C chemokine receptor type 1
Type:Enzyme
Mol. Mass.:39803.83
Organism:Homo sapiens (Human)
Description:P25024
Residue:350
BDBM50200887
NameBDBM50200887
Synonyms:(R)-3-(3,4-dioxo-2-(1-(thiophen-2-yl)propylamino)cyclobut-1-enylamino)-2-hydroxy-N,N-dimethylbenzamide | CHEMBL385715
TypeSmall organic molecule
Emp. Form.C20H21N3O4S
Mol. Mass.399.463
SMILESCC[C@@H](Nc1c(Nc2cccc(C(=O)N(C)C)c2O)c(=O)c1=O)c1cccs1