Reaction Details
TargetC-X-C chemokine receptor type 2
LigandBDBM50200880
Substrate/Competitorn/a
Meas. Tech.ChEMBL_584049 (CHEMBL1055929)
Ki 5±n/a nM
Citation Aki, CChao, JFerreira, JADwyer, MPYu, YChao, JMerritt, RJLai, GWu, MHipkin, RWFan, XGonsiorek, WFosseta, JRindgen, DFine, JLundell, DTaveras, AGBiju, P Diaminocyclobutenediones as potent and orally bioavailable CXCR2 receptor antagonists: SAR in the phenolic amide region. Bioorg Med Chem Lett19:4446-9 (2009) 
 
C-X-C chemokine receptor type 2
Name:C-X-C chemokine receptor type 2
Type:Protein
Mol. Mass.:40767.88
Organism:Homo sapiens (Human)
Description:P25025
Residue:360
BDBM50200880
NameBDBM50200880
Synonyms:(R)-2-hydroxy-N,N-dimethyl-3-(2-(1-(5-methylfuran-2-yl)propylamino)-3,4-dioxocyclobut-1-enylamino)benzamide CHEMBL216981 | SCH-527123
TypeSmall organic molecule
Emp. Form.C21H23N3O5
Mol. Mass.397.4244
SMILESCC[C@@H](Nc1c(Nc2cccc(C(=O)N(C)C)c2O)c(=O)c1=O)c1ccc(C)o1