Reaction Details
TargetC-X-C chemokine receptor type 2
LigandBDBM50297735
Substrate/Competitorn/a
Meas. Tech.ChEMBL_584049 (CHEMBL1055929)
Ki 11±n/a nM
Citation Aki, CChao, JFerreira, JADwyer, MPYu, YChao, JMerritt, RJLai, GWu, MHipkin, RWFan, XGonsiorek, WFosseta, JRindgen, DFine, JLundell, DTaveras, AGBiju, P Diaminocyclobutenediones as potent and orally bioavailable CXCR2 receptor antagonists: SAR in the phenolic amide region. Bioorg Med Chem Lett19:4446-9 (2009) 
 
C-X-C chemokine receptor type 2
Name:C-X-C chemokine receptor type 2
Type:Protein
Mol. Mass.:40767.88
Organism:Homo sapiens (Human)
Description:P25025
Residue:360
BDBM50297735
NameBDBM50297735
Synonyms:(R)-3-(3,4-dioxo-2-(1-phenylpropylamino)cyclobut-1-enylamino)-2-hydroxy-N-isopropyl-N-methylbenzamide | CHEMBL561812
TypeSmall organic molecule
Emp. Form.C24H27N3O4
Mol. Mass.421.4889
SMILESCC[C@@H](Nc1c(Nc2cccc(C(=O)N(C)C(C)C)c2O)c(=O)c1=O)c1ccccc1