Reaction Details
TargetC-X-C chemokine receptor type 2
LigandBDBM50297759
Substrate/Competitorn/a
Meas. Tech.ChEMBL_584049 (CHEMBL1055929)
Ki 27±n/a nM
Citation Aki, CChao, JFerreira, JADwyer, MPYu, YChao, JMerritt, RJLai, GWu, MHipkin, RWFan, XGonsiorek, WFosseta, JRindgen, DFine, JLundell, DTaveras, AGBiju, P Diaminocyclobutenediones as potent and orally bioavailable CXCR2 receptor antagonists: SAR in the phenolic amide region. Bioorg Med Chem Lett19:4446-9 (2009) 
 
C-X-C chemokine receptor type 2
Name:C-X-C chemokine receptor type 2
Type:Protein
Mol. Mass.:40767.88
Organism:Homo sapiens (Human)
Description:P25025
Residue:360
BDBM50297759
NameBDBM50297759
Synonyms:(R)-3-(3-(4-acetylpiperazine-1-carbonyl)-2-hydroxyphenylamino)-4-(1-phenylpropylamino)cyclobut-3-ene-1,2-dione | CHEMBL562670
TypeSmall organic molecule
Emp. Form.C26H28N4O5
Mol. Mass.476.5243
SMILESCC[C@@H](Nc1c(Nc2cccc(C(=O)N3CCN(CC3)C(C)=O)c2O)c(=O)c1=O)c1ccccc1