Reaction Details
TargetC-X-C chemokine receptor type 2
LigandBDBM50297740
Substrate/Competitorn/a
Meas. Tech.ChEMBL_584049 (CHEMBL1055929)
Ki 4.5±n/a nM
Citation Aki, CChao, JFerreira, JADwyer, MPYu, YChao, JMerritt, RJLai, GWu, MHipkin, RWFan, XGonsiorek, WFosseta, JRindgen, DFine, JLundell, DTaveras, AGBiju, P Diaminocyclobutenediones as potent and orally bioavailable CXCR2 receptor antagonists: SAR in the phenolic amide region. Bioorg Med Chem Lett19:4446-9 (2009) 
 
C-X-C chemokine receptor type 2
Name:C-X-C chemokine receptor type 2
Type:Protein
Mol. Mass.:40767.88
Organism:Homo sapiens (Human)
Description:P25025
Residue:360
BDBM50297740
NameBDBM50297740
Synonyms:(R)-3-(3,4-dioxo-2-(1-phenylpropylamino)cyclobut-1-enylamino)-2-hydroxy-N,N,4-trimethylbenzamide | CHEMBL562781
TypeSmall organic molecule
Emp. Form.C23H25N3O4
Mol. Mass.407.4623
SMILESCC[C@@H](Nc1c(Nc2c(C)ccc(C(=O)N(C)C)c2O)c(=O)c1=O)c1ccccc1