Reaction Details
TargetGlycogen synthase kinase-3 beta
LigandBDBM50299081
Substrate/Competitorn/a
Meas. Tech.ChEMBL_591611 (CHEMBL1042364)
IC50 34±n/a nM
Citation Saitoh, MKunitomo, JKimura, EIwashita, HUno, YOnishi, TUchiyama, NKawamoto, TTanaka, TMol, CDDougan, DRTextor, GPSnell, GPTakizawa, MItoh, FKori, M 2-{3-[4-(Alkylsulfinyl)phenyl]-1-benzofuran-5-yl}-5-methyl-1,3,4-oxadiazole derivatives as novel inhibitors of glycogen synthase kinase-3beta with good brain permeability. J Med Chem52:6270-86 (2009) 
 
Glycogen synthase kinase-3 beta
Name:Glycogen synthase kinase-3 beta
Type:Enzyme
Mol. Mass.:46756.38
Organism:Homo sapiens (Human)
Description:P49841
Residue:420
BDBM50299081
NameBDBM50299081
Synonyms:(S)-5-(5-methylfuran-2-yl)-3-(4-(methylsulfinyl)phenyl)benzofuran | CHEMBL574588
TypeSmall organic molecule
Emp. Form.C20H16O3S
Mol. Mass.336.404
SMILESCc1ccc(o1)-c1ccc2occ(-c3ccc(cc3)[S@](C)=O)c2c1