Reaction Details
TargetCyclin-dependent kinase 5
LigandBDBM50299083
Substrate/Competitorn/a
Meas. Tech.ChEMBL_591787 (CHEMBL1038776)
IC50>10000±n/a nM
Citation Saitoh, MKunitomo, JKimura, EIwashita, HUno, YOnishi, TUchiyama, NKawamoto, TTanaka, TMol, CDDougan, DRTextor, GPSnell, GPTakizawa, MItoh, FKori, M 2-{3-[4-(Alkylsulfinyl)phenyl]-1-benzofuran-5-yl}-5-methyl-1,3,4-oxadiazole derivatives as novel inhibitors of glycogen synthase kinase-3beta with good brain permeability. J Med Chem52:6270-86 (2009) 
 
Cyclin-dependent kinase 5
Name:Cyclin-dependent kinase 5
Type:Enzyme Subunit
Mol. Mass.:33308.61
Organism:Homo sapiens (Human)
Description:n/a
Residue:292
BDBM50299083
NameBDBM50299083
Synonyms:(S)-3-(4-(ethylsulfinyl)phenyl)-5-(5-methylfuran-2-yl)benzofuran | CHEMBL574613
TypeSmall organic molecule
Emp. Form.C21H18O3S
Mol. Mass.350.431
SMILESCC[S@](=O)c1ccc(cc1)-c1coc2ccc(cc12)-c1ccc(C)o1