Reaction Details
TargetMitogen-activated protein kinase 8
LigandBDBM50299083
Substrate/Competitorn/a
Meas. Tech.ChEMBL_591790 (CHEMBL1041530)
IC50>10000±n/a nM
Citation Saitoh, MKunitomo, JKimura, EIwashita, HUno, YOnishi, TUchiyama, NKawamoto, TTanaka, TMol, CDDougan, DRTextor, GPSnell, GPTakizawa, MItoh, FKori, M 2-{3-[4-(Alkylsulfinyl)phenyl]-1-benzofuran-5-yl}-5-methyl-1,3,4-oxadiazole derivatives as novel inhibitors of glycogen synthase kinase-3beta with good brain permeability. J Med Chem52:6270-86 (2009) 
 
Mitogen-activated protein kinase 8
Name:Mitogen-activated protein kinase 8
Type:Enzyme
Mol. Mass.:48297.57
Organism:Homo sapiens (Human)
Description:JNK-1 was purchased from Upstate Cell Signaling Solutions (formerly Upstate Biotechnology).
Residue:427
BDBM50299083
NameBDBM50299083
Synonyms:(S)-3-(4-(ethylsulfinyl)phenyl)-5-(5-methylfuran-2-yl)benzofuran | CHEMBL574613
TypeSmall organic molecule
Emp. Form.C21H18O3S
Mol. Mass.350.431
SMILESCC[S@](=O)c1ccc(cc1)-c1coc2ccc(cc12)-c1ccc(C)o1