Reaction Details
TargetGlycogen synthase kinase-3 beta
LigandBDBM50299087
Substrate/Competitorn/a
Meas. Tech.ChEMBL_591611 (CHEMBL1042364)
IC50 54±n/a nM
Citation Saitoh, MKunitomo, JKimura, EIwashita, HUno, YOnishi, TUchiyama, NKawamoto, TTanaka, TMol, CDDougan, DRTextor, GPSnell, GPTakizawa, MItoh, FKori, M 2-{3-[4-(Alkylsulfinyl)phenyl]-1-benzofuran-5-yl}-5-methyl-1,3,4-oxadiazole derivatives as novel inhibitors of glycogen synthase kinase-3beta with good brain permeability. J Med Chem52:6270-86 (2009) 
 
Glycogen synthase kinase-3 beta
Name:Glycogen synthase kinase-3 beta
Type:Enzyme
Mol. Mass.:46756.38
Organism:Homo sapiens (Human)
Description:P49841
Residue:420
BDBM50299087
NameBDBM50299087
Synonyms:2-[3-(4-Methoxyphenyl)-1-benzofuran-5-yl]-5-methyl-1,3,4-oxadiazole | CHEMBL576183
TypeSmall organic molecule
Emp. Form.C20H16O3
Mol. Mass.304.3392
SMILESCOc1ccc(cc1)-c1coc2ccc(cc12)-c1ccc(C)o1