Reaction Details
TargetRho-associated protein kinase 1
LigandBDBM50299360
Substrate/Competitorn/a
Meas. Tech.ChEMBL_590312 (CHEMBL1054435)
IC50 6±n/a nM
Citation Ho, KKBeasley, JRBelanger, LBlack, DChan, JHDunn, DHu, BKlon, AKultgen, SGOhlmeyer, MParlato, SMRay, PCPham, QRong, YRoughton, ALWalker, TLWright, JXu, KXu, YZhang, LWebb, M Triazine and pyrimidine based ROCK inhibitors with efficacy in spontaneous hypertensive rat model. Bioorg Med Chem Lett19:6027-31 (2009) 
 
Rho-associated protein kinase 1
Name:Rho-associated protein kinase 1
Type:Serine/threonine-protein kinase
Mol. Mass.:158156.77
Organism:Homo sapiens (Human)
Description:Q13464
Residue:1354
BDBM50299360
NameBDBM50299360
Synonyms:CHEMBL575741 | N2-(2,3-dihydro-1H-inden-2-yl)-6-(piperazin-1-yl)-N4-(pyridin-4-yl)-1,3,5-triazine-2,4-diamine
TypeSmall organic molecule
Emp. Form.C21H24N8
Mol. Mass.388.4689
SMILESC1C(Cc2ccccc12)Nc1nc(Nc2ccncc2)nc(n1)N1CCNCC1