Reaction Details
TargetRho-associated protein kinase 1
LigandBDBM50299362
Substrate/Competitorn/a
Meas. Tech.ChEMBL_590312 (CHEMBL1054435)
IC50 326±n/a nM
Citation Ho, KKBeasley, JRBelanger, LBlack, DChan, JHDunn, DHu, BKlon, AKultgen, SGOhlmeyer, MParlato, SMRay, PCPham, QRong, YRoughton, ALWalker, TLWright, JXu, KXu, YZhang, LWebb, M Triazine and pyrimidine based ROCK inhibitors with efficacy in spontaneous hypertensive rat model. Bioorg Med Chem Lett19:6027-31 (2009) 
 
Rho-associated protein kinase 1
Name:Rho-associated protein kinase 1
Type:Serine/threonine-protein kinase
Mol. Mass.:158156.77
Organism:Homo sapiens (Human)
Description:Q13464
Residue:1354
BDBM50299362
NameBDBM50299362
Synonyms:CHEMBL575798 | N2-phenethyl-6-(piperazin-1-yl)-N4-(pyridin-4-yl)-1,3,5-triazine-2,4-diamine
TypeSmall organic molecule
Emp. Form.C20H24N8
Mol. Mass.376.4582
SMILESC(Cc1ccccc1)Nc1nc(Nc2ccncc2)nc(n1)N1CCNCC1