Reaction Details
TargetExtracellular calcium-sensing receptor
LigandBDBM50299670
Substrate/Competitorn/a
Meas. Tech.ChEMBL_592454 (CHEMBL1039645)
EC50 194±n/a nM
Citation Poon, SFSt Jean, DJHarrington, PEHenley, CDavis, JMorony, SLott, FDReagan, JDLu, JYYang, YFotsch, C Discovery and optimization of substituted 1-(1-phenyl-1H-pyrazol-3-yl)methanamines as potent and efficacious type II calcimimetics. J Med Chem52:6535-8 (2009) 
 
Extracellular calcium-sensing receptor
Name:Extracellular calcium-sensing receptor
Type:Protein
Mol. Mass.:120663.13
Organism:Homo sapiens (Human)
Description:P41180
Residue:1078
BDBM50299670
NameBDBM50299670
Synonyms:(R)-3-(2-chlorophenyl)-N-(1-(3-methoxyphenyl)ethyl)propan-1-amine [3-(2-Chloro-phenyl)-propyl]-[(R)-1-(3-methoxy-phenyl)-ethyl]-amine
TypeSmall organic molecule
Emp. Form.C18H22ClNO
Mol. Mass.303.826
SMILESCOc1cccc(c1)[C@@H](C)NCCCc1ccccc1Cl