Reaction Details
TargetExtracellular calcium-sensing receptor
LigandBDBM50299681
Substrate/Competitorn/a
Meas. Tech.ChEMBL_592454 (CHEMBL1039645)
EC50 70±n/a nM
Citation Poon, SFSt Jean, DJHarrington, PEHenley, CDavis, JMorony, SLott, FDReagan, JDLu, JYYang, YFotsch, C Discovery and optimization of substituted 1-(1-phenyl-1H-pyrazol-3-yl)methanamines as potent and efficacious type II calcimimetics. J Med Chem52:6535-8 (2009) 
 
Extracellular calcium-sensing receptor
Name:Extracellular calcium-sensing receptor
Type:Protein
Mol. Mass.:120663.13
Organism:Homo sapiens (Human)
Description:P41180
Residue:1078
BDBM50299681
NameBDBM50299681
Synonyms:(R)-N-((R)-1-(5-methoxy-1-(4-(trifluoromethyl)phenyl)-1H-pyrazol-3-yl)ethyl)-1-phenylethanamine | CHEMBL569863
TypeSmall organic molecule
Emp. Form.C21H22F3N3O
Mol. Mass.389.4141
SMILESCOc1cc(nn1-c1ccc(cc1)C(F)(F)F)[C@@H](C)N[C@H](C)c1ccccc1