Reaction Details
TargetExtracellular calcium-sensing receptor
LigandBDBM50299684
Substrate/Competitorn/a
Meas. Tech.ChEMBL_592454 (CHEMBL1039645)
EC50 57±n/a nM
Citation Poon, SFSt Jean, DJHarrington, PEHenley, CDavis, JMorony, SLott, FDReagan, JDLu, JYYang, YFotsch, C Discovery and optimization of substituted 1-(1-phenyl-1H-pyrazol-3-yl)methanamines as potent and efficacious type II calcimimetics. J Med Chem52:6535-8 (2009) 
 
Extracellular calcium-sensing receptor
Name:Extracellular calcium-sensing receptor
Type:Protein
Mol. Mass.:120663.13
Organism:Homo sapiens (Human)
Description:P41180
Residue:1078
BDBM50299684
NameBDBM50299684
Synonyms:(1R)-1-(3-chlorophenyl)-N-((1R)-1-(1-(3-chlorophenyl)-5-methoxy-1H-pyrazol-3-yl)ethyl)ethanamine | CHEMBL577333
TypeSmall organic molecule
Emp. Form.C20H21Cl2N3O
Mol. Mass.390.306
SMILESCOc1cc(nn1-c1cccc(Cl)c1)[C@@H](C)N[C@H](C)c1cccc(Cl)c1