Reaction Details
TargetSerine/threonine-protein kinase Sgk1
LigandBDBM50299910
Substrate/Competitorn/a
Meas. Tech.ChEMBL_594453 (CHEMBL1041502)
IC50>1E4±n/a nM
Citation Okamoto, MTakayama, KShimizu, TIshida, KTakahashi, OFuruya, T Identification of death-associated protein kinases inhibitors using structure-based virtual screening. J Med Chem52:7323-7 (2009) 
 
Serine/threonine-protein kinase Sgk1
Name:Serine/threonine-protein kinase Sgk1
Type:Other Protein Type
Mol. Mass.:48954.40
Organism:Homo sapiens (Human)
Description:Recombinant human SGK-1 enzyme produced in a baculovirus system.
Residue:431
BDBM50299910
NameBDBM50299910
Synonyms:4-(pyridin-3-ylmethylene)-2-styryloxazol-5(4H)-one | CHEMBL565286
TypeSmall organic molecule
Emp. Form.C17H12N2O2
Mol. Mass.276.2894
SMILESO=C1OC(\C=C\c2ccccc2)=N/C/1=C\c1cccnc1