Reaction Details
TargetDual specificity calcium/calmodulin-dependent 3',5'-cyclic nucleotide phosphodiesterase 1C
LigandBDBM50300105
Substrate/Competitorn/a
Meas. Tech.ChEMBL_593498 (CHEMBL1047622)
IC50 269±n/a nM
Citation Verhoest, PRProulx-Lafrance, CCorman, MChenard, LHelal, CJHou, XKleiman, RLiu, SMarr, EMenniti, FSSchmidt, CJVanase-Frawley, MSchmidt, AWWilliams, RDNelson, FRFonseca, KRLiras, S Identification of a brain penetrant PDE9A inhibitor utilizing prospective design and chemical enablement as a rapid lead optimization strategy. J Med Chem52:7946-9 (2009) 
 
Dual specificity calcium/calmodulin-dependent 3',5'-cyclic nucleotide phosphodiesterase 1C
Name:Dual specificity calcium/calmodulin-dependent 3',5'-cyclic nucleotide phosphodiesterase 1C
Type:Enzyme
Mol. Mass.:80778.58
Organism:Homo sapiens (Human)
Description:Q14123
Residue:709
BDBM50300105
NameBDBM50300105
Synonyms:CHEMBL575775 | trans-1-cyclopentyl-6-(1-((6-methoxypyridin-3-yl)methyl)-4-methylpyrrolidin-3-yl)-1H-pyrazolo[3,4-d]pyrimidin-4(5H)-one
TypeSmall organic molecule
Emp. Form.C22H28N6O2
Mol. Mass.408.4967
SMILESCOc1ccc(CN2C[C@@H](C)[C@@H](C2)c2nc3n(ncc3c(=O)[nH]2)C2CCCC2)cn1