Reaction Details
TargetHigh affinity cGMP-specific 3',5'-cyclic phosphodiesterase 9A
LigandBDBM50300107
Substrate/Competitorn/a
Meas. Tech.ChEMBL_593497 (CHEMBL1047621)
IC50 11±n/a nM
Citation Verhoest, PRProulx-Lafrance, CCorman, MChenard, LHelal, CJHou, XKleiman, RLiu, SMarr, EMenniti, FSSchmidt, CJVanase-Frawley, MSchmidt, AWWilliams, RDNelson, FRFonseca, KRLiras, S Identification of a brain penetrant PDE9A inhibitor utilizing prospective design and chemical enablement as a rapid lead optimization strategy. J Med Chem52:7946-9 (2009) 
 
High affinity cGMP-specific 3',5'-cyclic phosphodiesterase 9A
Name:High affinity cGMP-specific 3',5'-cyclic phosphodiesterase 9A
Type:Protein
Mol. Mass.:68488.40
Organism:Homo sapiens (Human)
Description:O76083
Residue:593
BDBM50300107
NameBDBM50300107
Synonyms:CHEMBL578033 | trans-1-cyclopentyl-6-(4-methyl-1-((2-methylpyrimidin-5-yl)methyl)pyrrolidin-3-yl)-1H-pyrazolo[3,4-d]pyrimidin-4(5H)-one
TypeSmall organic molecule
Emp. Form.C21H27N7O
Mol. Mass.393.4854
SMILESC[C@@H]1CN(Cc2cnc(C)nc2)C[C@H]1c1nc2n(ncc2c(=O)[nH]1)C1CCCC1