Reaction Details
TargetHigh affinity cGMP-specific 3',5'-cyclic phosphodiesterase 9A
LigandBDBM50300105
Substrate/Competitorn/a
Meas. Tech.ChEMBL_593497 (CHEMBL1047621)
IC50 29±n/a nM
Citation Verhoest, PRProulx-Lafrance, CCorman, MChenard, LHelal, CJHou, XKleiman, RLiu, SMarr, EMenniti, FSSchmidt, CJVanase-Frawley, MSchmidt, AWWilliams, RDNelson, FRFonseca, KRLiras, S Identification of a brain penetrant PDE9A inhibitor utilizing prospective design and chemical enablement as a rapid lead optimization strategy. J Med Chem52:7946-9 (2009) 
 
High affinity cGMP-specific 3',5'-cyclic phosphodiesterase 9A
Name:High affinity cGMP-specific 3',5'-cyclic phosphodiesterase 9A
Type:Protein
Mol. Mass.:68488.40
Organism:Homo sapiens (Human)
Description:O76083
Residue:593
BDBM50300105
NameBDBM50300105
Synonyms:CHEMBL575775 | trans-1-cyclopentyl-6-(1-((6-methoxypyridin-3-yl)methyl)-4-methylpyrrolidin-3-yl)-1H-pyrazolo[3,4-d]pyrimidin-4(5H)-one
TypeSmall organic molecule
Emp. Form.C22H28N6O2
Mol. Mass.408.4967
SMILESCOc1ccc(CN2C[C@@H](C)[C@@H](C2)c2nc3n(ncc3c(=O)[nH]2)C2CCCC2)cn1