Reaction Details
TargetHematopoietic prostaglandin D synthase
LigandBDBM50300129
Substrate/Competitorn/a
Meas. Tech.ChEMBL_593692 (CHEMBL1044145)
IC50 2E2±n/a nM
Citation Weber, JEOakley, AJChrist, ANClark, AGHayes, JDHall, RHume, DABoard, PGSmythe, MLFlanagan, JU Identification and characterisation of new inhibitors for the human hematopoietic prostaglandin D2 synthase. Eur J Med Chem45:447-54 (2010) 
 
Hematopoietic prostaglandin D synthase
Name:Hematopoietic prostaglandin D synthase
Type:Enzyme
Mol. Mass.:23341.07
Organism:Homo sapiens (Human)
Description:The protein was expressed in E. coli strain BL21(DE3) with an N-terminal 6-His tag.
Residue:199
BDBM50300129
NameBDBM50300129
Synonyms:CHEMBL572528 Cibacron Blue 3Ga
TypeSmall organic molecule
Emp. Form.C29H20ClN7O11S3
Mol. Mass.774.157
SMILESNc1c(cc(Nc2ccc(Nc3nc(Cl)nc(Nc4ccccc4S(O)(=O)=O)n3)c(c2)S(O)(=O)=O)c2C(=O)c3ccccc3C(=O)c12)S(O)(=O)=O