Reaction Details
TargetMitogen-activated protein kinase 10
LigandBDBM50206421
Substrate/Competitorn/a
Meas. Tech.ChEMBL_599889 (CHEMBL1045454)
IC50 540±n/a nM
Citation Peifer, CAbadleh, MBischof, JHauser, DSchattel, VHirner, HKnippschild, ULaufer, S 3,4-Diaryl-isoxazoles and -imidazoles as potent dual inhibitors of p38alpha mitogen activated protein kinase and casein kinase 1delta. J Med Chem52:7618-30 (2009) 
 
Mitogen-activated protein kinase 10
Name:Mitogen-activated protein kinase 10
Type:Enzyme
Mol. Mass.:52586.89
Organism:Homo sapiens (Human)
Description:n/a
Residue:464
BDBM50206421
NameBDBM50206421
Synonyms:3-(4-fluorophenyl)-5-isopropyl-4-(pyridin-4-yl)isoxazole 4-[3-(4-fluorophenyl)-5-isopropylisoxazol-4-yl]pyridine | CHEMBL220227
TypeSmall organic molecule
Emp. Form.C17H15FN2O
Mol. Mass.282.3122
SMILESCC(C)c1onc(c1-c1ccncc1)-c1ccc(F)cc1