Reaction Details
TargetC-X-C chemokine receptor type 3
LigandBDBM50301331
Substrate/Competitorn/a
Meas. Tech.ChEMBL_599488 (CHEMBL1049024)
Ki 2700±n/a nM
Citation McGuinness, BFCarroll, CDZawacki, LGDong, GYang, CHobbs, DWJacob-Samuel, BHall, JWJenh, CHKozlowski, JAAnilkumar, GNRosenblum, SB Novel CXCR3 antagonists with a piperazinyl-piperidine core. Bioorg Med Chem Lett19:5205-8 (2009) 
 
C-X-C chemokine receptor type 3
Name:C-X-C chemokine receptor type 3
Type:Enzyme Catalytic Domain
Mol. Mass.:40665.65
Organism:Homo sapiens (Human)
Description:n/a
Residue:368
BDBM50301331
NameBDBM50301331
Synonyms:5-chloro-6-(1'-(4-chlorobenzyl)-4,4'-bipiperidin-1-yl)-N-(3,4-dichlorobenzyl)nicotinamide | CHEMBL570958
TypeSmall organic molecule
Emp. Form.C30H32Cl4N4O
Mol. Mass.606.413
SMILESClc1ccc(CN2CCC(CC2)C2CCN(CC2)c2ncc(cc2Cl)C(=O)NCc2ccc(Cl)c(Cl)c2)cc1