Reaction Details
TargetC-X-C chemokine receptor type 3
LigandBDBM50301354
Substrate/Competitorn/a
Meas. Tech.ChEMBL_599488 (CHEMBL1049024)
Ki 870±n/a nM
Citation McGuinness, BFCarroll, CDZawacki, LGDong, GYang, CHobbs, DWJacob-Samuel, BHall, JWJenh, CHKozlowski, JAAnilkumar, GNRosenblum, SB Novel CXCR3 antagonists with a piperazinyl-piperidine core. Bioorg Med Chem Lett19:5205-8 (2009) 
 
C-X-C chemokine receptor type 3
Name:C-X-C chemokine receptor type 3
Type:Enzyme Catalytic Domain
Mol. Mass.:40665.65
Organism:Homo sapiens (Human)
Description:n/a
Residue:368
BDBM50301354
NameBDBM50301354
Synonyms:1-(5-chloro-6-(4-(1-(4-chlorobenzyl)piperidin-4-yl)piperazin-1-yl)pyridin-3-yl)-N-(3,4-dichlorobenzyl)methanamine | CHEMBL583651
TypeSmall organic molecule
Emp. Form.C29H33Cl4N5
Mol. Mass.593.418
SMILESClc1ccc(CN2CCC(CC2)N2CCN(CC2)c2ncc(CNCc3ccc(Cl)c(Cl)c3)cc2Cl)cc1