Reaction Details
Target5-hydroxytryptamine receptor 2B
LigandBDBM50302141
Substrate/Competitorn/a
Meas. Tech.ChEMBL_598880 (CHEMBL1047256)
EC50>10000±n/a nM
Citation Allerton, CMAndrews, MDBlagg, JEllis, DEvrard, EGreen, MPLiu, KKMcMurray, GRalph, MSanderson, VWard, RWatson, L Design and synthesis of pyridazinone-based 5-HT(2C) agonists. Bioorg Med Chem Lett19:5791-5 (2009) 
 
5-hydroxytryptamine receptor 2B
Name:5-hydroxytryptamine receptor 2B
Type:G Protein-Coupled Receptor (GPCR)
Mol. Mass.:54312.47
Organism:Homo sapiens (Human)
Description:Receptor binding assays were performed using human clone stably expressed in CHO cells.
Residue:481
BDBM50302141
NameBDBM50302141
Synonyms:2-(2-(2-chlorophenoxy)ethyl)-6-(piperazin-1-yl)pyridazin-3(2H)-one | CHEMBL570937
TypeSmall organic molecule
Emp. Form.C16H19ClN4O2
Mol. Mass.334.801
SMILESClc1ccccc1OCCn1nc(ccc1=O)N1CCNCC1