Reaction Details
Target5-hydroxytryptamine receptor 2C
LigandBDBM50302145
Substrate/Competitorn/a
Meas. Tech.ChEMBL_598878 (CHEMBL1046454)
Ki 325±n/a nM
Citation Allerton, CMAndrews, MDBlagg, JEllis, DEvrard, EGreen, MPLiu, KKMcMurray, GRalph, MSanderson, VWard, RWatson, L Design and synthesis of pyridazinone-based 5-HT(2C) agonists. Bioorg Med Chem Lett19:5791-5 (2009) 
 
5-hydroxytryptamine receptor 2C
Name:5-hydroxytryptamine receptor 2C
Type:G Protein-Coupled Receptor (GPCR)
Mol. Mass.:51836.79
Organism:Homo sapiens (Human)
Description:P28335
Residue:458
BDBM50302145
NameBDBM50302145
Synonyms:(R)-2-(2-(2-chlorophenoxy)ethyl)-6-(2-methylpiperazin-1-yl)pyridazin-3(2H)-one | CHEMBL570023
TypeSmall organic molecule
Emp. Form.C17H21ClN4O2
Mol. Mass.348.827
SMILESC[C@@H]1CNCCN1c1ccc(=O)n(CCOc2ccccc2Cl)n1