Reaction Details
TargetFructose-1,6-bisphosphatase 1
LigandBDBM50302495
Substrate/Competitorn/a
Meas. Tech.ChEMBL_597625 (CHEMBL1039077)
IC50 13±n/a nM
Citation Tsukada, TTakahashi, MTakemoto, TKanno, OYamane, TKawamura, SNishi, T Synthesis, SAR, and X-ray structure of tricyclic compounds as potent FBPase inhibitors. Bioorg Med Chem Lett19:5909-12 (2009) 
 
Fructose-1,6-bisphosphatase 1
Name:Fructose-1,6-bisphosphatase 1
Type:Protein
Mol. Mass.:36843.58
Organism:Homo sapiens (Human)
Description:Liver FBPase (P09467)
Residue:338
BDBM50302495
NameBDBM50302495
Synonyms:2-amino-4,5-dihydronaphtho[1,2-d][1,3]thiazol-8-yl dihydrogen phosphate CHEMBL565809
TypeSmall organic molecule
Emp. Form.C11H11N2O4PS
Mol. Mass.298.255
SMILESNc1nc-2c(CCc3ccc(OP(O)(O)=O)cc-23)s1