Reaction Details
TargetSerine/threonine-protein kinase B-raf
LigandBDBM50303098
Substrate/Competitorn/a
Meas. Tech.ChEMBL_597720 (CHEMBL1043507)
IC50 0.4±n/a nM
Citation Di Grandi, MJBerger, DMHopper, DWZhang, CDutia, MDunnick, ALTorres, NLevin, JIDiamantidis, GZapf, CWBloom, JDHu, YPowell, DWojciechowicz, DCollins, KFrommer, E Novel pyrazolopyrimidines as highly potent B-Raf inhibitors. Bioorg Med Chem Lett19:6957-61 (2009) 
 
Serine/threonine-protein kinase B-raf
Name:Serine/threonine-protein kinase B-raf
Type:Serine/threonine-protein kinase
Mol. Mass.:84446.00
Organism:Homo sapiens (Human)
Description:P15056
Residue:766
BDBM50303098
NameBDBM50303098
Synonyms:5-(7-(8-azabicyclo[3.2.1]octan-3-yl)-2-(pyridin-4-yl)-1,2-dihydropyrazolo[1,5-a]pyrimidin-3-yl)-2-chlorophenol | CHEMBL569081
TypeSmall organic molecule
Emp. Form.C24H22ClN5O
Mol. Mass.431.917
SMILESOc1cc(ccc1Cl)-c1c(nn2c(ccnc12)C1CC2CCC(C1)N2)-c1ccncc1