Reaction Details
TargetSerine/threonine-protein kinase B-raf
LigandBDBM50303118
Substrate/Competitorn/a
Meas. Tech.ChEMBL_597720 (CHEMBL1043507)
IC50 46.6±n/a nM
Citation Di Grandi, MJBerger, DMHopper, DWZhang, CDutia, MDunnick, ALTorres, NLevin, JIDiamantidis, GZapf, CWBloom, JDHu, YPowell, DWojciechowicz, DCollins, KFrommer, E Novel pyrazolopyrimidines as highly potent B-Raf inhibitors. Bioorg Med Chem Lett19:6957-61 (2009) 
 
Serine/threonine-protein kinase B-raf
Name:Serine/threonine-protein kinase B-raf
Type:Serine/threonine-protein kinase
Mol. Mass.:84446.00
Organism:Homo sapiens (Human)
Description:P15056
Residue:766
BDBM50303118
NameBDBM50303118
Synonyms:7-(8-ethyl-8-azabicyclo[3.2.1]octan-3-yl)-3-(1H-indazol-4-yl)-2-(pyridin-4-yl)-1,2-dihydropyrazolo[1,5-a]pyrimidine | CHEMBL570422
TypeSmall organic molecule
Emp. Form.C27H27N7
Mol. Mass.449.5502
SMILESCCN1C2CCC1CC(C2)c1ccnc2c(c(nn12)-c1ccncc1)-c1cccc2[nH]ncc12