Reaction Details
TargetSerine/threonine-protein kinase B-raf
LigandBDBM50303120
Substrate/Competitorn/a
Meas. Tech.ChEMBL_597720 (CHEMBL1043507)
IC50 75.90±n/a nM
Citation Di Grandi, MJBerger, DMHopper, DWZhang, CDutia, MDunnick, ALTorres, NLevin, JIDiamantidis, GZapf, CWBloom, JDHu, YPowell, DWojciechowicz, DCollins, KFrommer, E Novel pyrazolopyrimidines as highly potent B-Raf inhibitors. Bioorg Med Chem Lett19:6957-61 (2009) 
 
Serine/threonine-protein kinase B-raf
Name:Serine/threonine-protein kinase B-raf
Type:Serine/threonine-protein kinase
Mol. Mass.:84446.00
Organism:Homo sapiens (Human)
Description:P15056
Residue:766
BDBM50303120
NameBDBM50303120
Synonyms:1-(3-(3-(1H-indazol-4-yl)-2-(pyridin-4-yl)-1,2-dihydropyrazolo[1,5-a]pyrimidin-7-yl)-8-azabicyclo[3.2.1]octan-8-yl)propan-2-one | CHEMBL571971
TypeSmall organic molecule
Emp. Form.C28H27N7O
Mol. Mass.477.5603
SMILESCC(=O)CN1C2CCC1CC(C2)c1ccnc2c(c(nn12)-c1ccncc1)-c1cccc2[nH]ncc12