Reaction Details
TargetSerine/threonine-protein kinase B-raf
LigandBDBM50303125
Substrate/Competitorn/a
Meas. Tech.ChEMBL_597720 (CHEMBL1043507)
IC50 4.4±n/a nM
Citation Di Grandi, MJBerger, DMHopper, DWZhang, CDutia, MDunnick, ALTorres, NLevin, JIDiamantidis, GZapf, CWBloom, JDHu, YPowell, DWojciechowicz, DCollins, KFrommer, E Novel pyrazolopyrimidines as highly potent B-Raf inhibitors. Bioorg Med Chem Lett19:6957-61 (2009) 
 
Serine/threonine-protein kinase B-raf
Name:Serine/threonine-protein kinase B-raf
Type:Serine/threonine-protein kinase
Mol. Mass.:84446.00
Organism:Homo sapiens (Human)
Description:P15056
Residue:766
BDBM50303125
NameBDBM50303125
Synonyms:CHEMBL571744 | ethyl 3-(2-(pyridin-4-yl)-3-(7-(trifluoromethyl)-1H-indazol-4-yl)-1,2-dihydropyrazolo[1,5-a]pyrimidin-7-yl)-8-azabicyclo[3.2.1]octane-8-carboxylate
TypeSmall organic molecule
Emp. Form.C29H26F3N7O2
Mol. Mass.561.5576
SMILESCCOC(=O)N1C2CCC1CC(C2)c1ccnc2c(c(nn12)-c1ccncc1)-c1ccc(c2[nH]ncc12)C(F)(F)F