Reaction Details
TargetCytochrome P450 2C19
LigandBDBM50305505
Substrate/Competitorn/a
Meas. Tech.ChEMBL_604209 (CHEMBL1050354)
IC50 110±n/a nM
Citation Tang, YWittlin, SCharman, SAChollet, JChiu, FCMorizzi, JJohnson, LMTomas, JSScheurer, CSnyder, CZhou, LDong, YCharman, WNMatile, HUrwyler, HDorn, AVennerstrom, JL The comparative antimalarial properties of weak base and neutral synthetic ozonides. Bioorg Med Chem Lett20:563-6 (2010) 
 
Cytochrome P450 2C19
Name:Cytochrome P450 2C19
Type:Enzyme
Mol. Mass.:55935.47
Organism:Homo sapiens (Human)
Description:P33261
Residue:490
BDBM50305505
NameBDBM50305505
Synonyms:CHEMBL227855 dispiro[adamantane-2,2'-[1,3,5]trioxolane-4',1''-cyclohexane]-4''-ylmethanamine
TypeSmall organic molecule
Emp. Form.C17H27NO3
Mol. Mass.293.4012
SMILESNC[C@H]1CC[C@]2(CC1)OO[C@@]1(O2)C2CC3CC(C2)CC1C3