Reaction Details
TargetFree fatty acid receptor 2
LigandBDBM50305909
Substrate/Competitorn/a
Meas. Tech.ChEMBL_605612 (CHEMBL1069216)
IC50 500±n/a nM
Citation Wang, YJiao, XKayser, FLiu, JWang, ZWanska, MGreenberg, JWeiszmann, JGe, HTian, HWong, SSchwandner, RLee, TLi, Y The first synthetic agonists of FFA2: Discovery and SAR of phenylacetamides as allosteric modulators. Bioorg Med Chem Lett20:493-8 (2010) 
 
Free fatty acid receptor 2
Name:Free fatty acid receptor 2
Type:PROTEIN
Mol. Mass.:37156.44
Organism:Homo sapiens (Human)
Description:ChEMBL_1508993
Residue:330
BDBM50305909
NameBDBM50305909
Synonyms:(S)-2-(4-chlorophenyl)-3,3-dimethyl-N-(5-(methylthio)thiazol-2-yl)butanamide | CHEMBL594758
TypeSmall organic molecule
Emp. Form.C16H19ClN2OS2
Mol. Mass.354.918
SMILESCSc1cnc(NC(=O)[C@H](c2ccc(Cl)cc2)C(C)(C)C)s1