Reaction Details
TargetFree fatty acid receptor 2
LigandBDBM50305910
Substrate/Competitorn/a
Meas. Tech.ChEMBL_605612 (CHEMBL1069216)
IC50 3400±n/a nM
Citation Wang, YJiao, XKayser, FLiu, JWang, ZWanska, MGreenberg, JWeiszmann, JGe, HTian, HWong, SSchwandner, RLee, TLi, Y The first synthetic agonists of FFA2: Discovery and SAR of phenylacetamides as allosteric modulators. Bioorg Med Chem Lett20:493-8 (2010) 
 
Free fatty acid receptor 2
Name:Free fatty acid receptor 2
Type:PROTEIN
Mol. Mass.:37156.44
Organism:Homo sapiens (Human)
Description:ChEMBL_1508993
Residue:330
BDBM50305910
NameBDBM50305910
Synonyms:(S)-2-(4-chlorophenyl)-3,3-dimethyl-N-(5-(methylsulfonyl)thiazol-2-yl)butanamide | CHEMBL609586
TypeSmall organic molecule
Emp. Form.C16H19ClN2O3S2
Mol. Mass.386.917
SMILESCC(C)(C)[C@H](C(=O)Nc1ncc(s1)S(C)(=O)=O)c1ccc(Cl)cc1