Reaction Details
TargetFree fatty acid receptor 2
LigandBDBM50305913
Substrate/Competitorn/a
Meas. Tech.ChEMBL_605612 (CHEMBL1069216)
IC50 1600±n/a nM
Citation Wang, YJiao, XKayser, FLiu, JWang, ZWanska, MGreenberg, JWeiszmann, JGe, HTian, HWong, SSchwandner, RLee, TLi, Y The first synthetic agonists of FFA2: Discovery and SAR of phenylacetamides as allosteric modulators. Bioorg Med Chem Lett20:493-8 (2010) 
 
Free fatty acid receptor 2
Name:Free fatty acid receptor 2
Type:PROTEIN
Mol. Mass.:37156.44
Organism:Homo sapiens (Human)
Description:ChEMBL_1508993
Residue:330
BDBM50305913
NameBDBM50305913
Synonyms:(S)-2-(4-chlorophenyl)-N-(5-(dimethylamino)thiazol-2-yl)-3,3-dimethylbutanamide | CHEMBL594737
TypeSmall organic molecule
Emp. Form.C17H22ClN3OS
Mol. Mass.351.894
SMILESCN(C)c1cnc(NC(=O)[C@H](c2ccc(Cl)cc2)C(C)(C)C)s1