Reaction Details
TargetFree fatty acid receptor 2
LigandBDBM50305916
Substrate/Competitorn/a
Meas. Tech.ChEMBL_605612 (CHEMBL1069216)
IC50 2400±n/a nM
Citation Wang, YJiao, XKayser, FLiu, JWang, ZWanska, MGreenberg, JWeiszmann, JGe, HTian, HWong, SSchwandner, RLee, TLi, Y The first synthetic agonists of FFA2: Discovery and SAR of phenylacetamides as allosteric modulators. Bioorg Med Chem Lett20:493-8 (2010) 
 
Free fatty acid receptor 2
Name:Free fatty acid receptor 2
Type:PROTEIN
Mol. Mass.:37156.44
Organism:Homo sapiens (Human)
Description:ChEMBL_1508993
Residue:330
BDBM50305916
NameBDBM50305916
Synonyms:(S)-2-(4-Chloro-phenyl)-N-[5-(1,1-dioxo-1lambda*6*-thiomorpholin-4-yl)-thiazol-2-yl]-3,3-dimethyl-butyramide | CHEMBL594507
TypeSmall organic molecule
Emp. Form.C19H24ClN3O3S2
Mol. Mass.441.995
SMILESCC(C)(C)[C@H](C(=O)Nc1ncc(s1)N1CCS(=O)(=O)CC1)c1ccc(Cl)cc1