Reaction Details
TargetFree fatty acid receptor 2
LigandBDBM50305923
Substrate/Competitorn/a
Meas. Tech.ChEMBL_605612 (CHEMBL1069216)
IC50 600±n/a nM
Citation Wang, YJiao, XKayser, FLiu, JWang, ZWanska, MGreenberg, JWeiszmann, JGe, HTian, HWong, SSchwandner, RLee, TLi, Y The first synthetic agonists of FFA2: Discovery and SAR of phenylacetamides as allosteric modulators. Bioorg Med Chem Lett20:493-8 (2010) 
 
Free fatty acid receptor 2
Name:Free fatty acid receptor 2
Type:PROTEIN
Mol. Mass.:37156.44
Organism:Homo sapiens (Human)
Description:ChEMBL_1508993
Residue:330
BDBM50305923
NameBDBM50305923
Synonyms:(S)-2-(4-chlorophenyl)-4-methyl-N-(thiazol-2-yl)pentanamide | CHEMBL608696
TypeSmall organic molecule
Emp. Form.C15H17ClN2OS
Mol. Mass.308.826
SMILESCC(C)C[C@H](C(=O)Nc1nccs1)c1ccc(Cl)cc1