Reaction Details
TargetFree fatty acid receptor 2
LigandBDBM50305967
Substrate/Competitorn/a
Meas. Tech.ChEMBL_605612 (CHEMBL1069216)
IC50 4300±n/a nM
Citation Wang, YJiao, XKayser, FLiu, JWang, ZWanska, MGreenberg, JWeiszmann, JGe, HTian, HWong, SSchwandner, RLee, TLi, Y The first synthetic agonists of FFA2: Discovery and SAR of phenylacetamides as allosteric modulators. Bioorg Med Chem Lett20:493-8 (2010) 
 
Free fatty acid receptor 2
Name:Free fatty acid receptor 2
Type:PROTEIN
Mol. Mass.:37156.44
Organism:Homo sapiens (Human)
Description:ChEMBL_1508993
Residue:330
BDBM50305967
NameBDBM50305967
Synonyms:(S)-N-(5-chlorobenzo[d]oxazol-2-yl)-2-(4-chlorophenyl)-3-methylbutanamide | CHEMBL610740
TypeSmall organic molecule
Emp. Form.C18H16Cl2N2O2
Mol. Mass.363.238
SMILESCC(C)[C@H](C(=O)Nc1nc2cc(Cl)ccc2o1)c1ccc(Cl)cc1