Reaction Details
TargetRAC-alpha serine/threonine-protein kinase
LigandBDBM50306161
Substrate/Competitorn/a
Meas. Tech.ChEMBL_606082 (CHEMBL1072610)
IC50 6±n/a nM
Citation Lin, HYamashita, DSXie, RZeng, JWang, WLeber, JSafonov, IGVerma, SLi, MLafrance, LVenslavsky, JTakata, DLuengo, JIKahana, JAZhang, SRobell, KALevy, DKumar, RChoudhry, AESchaber, MLai, ZBrown, BSDonovan, BTMinthorn, EABrown, KKHeerding, DA Tetrasubstituted pyridines as potent and selective AKT inhibitors: Reduced CYP450 and hERG inhibition of aminopyridines. Bioorg Med Chem Lett20:684-8 (2010) 
 
RAC-alpha serine/threonine-protein kinase
Name:RAC-alpha serine/threonine-protein kinase
Type:Enzyme
Mol. Mass.:55681.25
Organism:Homo sapiens (Human)
Description:P31749
Residue:480
BDBM50306161
NameBDBM50306161
Synonyms:3-((S)-2-amino-3-phenylpropoxy)-5-(3-methyl-1H-pyrazolo[4,3-b]pyrazin-5-yl)-6-(2-methylfuran-3-yl)pyridin-2-amine | CHEMBL594755
TypeSmall organic molecule
Emp. Form.C25H25N7O2
Mol. Mass.455.5117
SMILESCc1n[nH]c2ncc(nc12)-c1cc(OC[C@@H](N)Cc2ccccc2)c(N)nc1-c1ccoc1C