Reaction Details
TargetHistamine H3 receptor
LigandBDBM50309840
Substrate/Competitorn/a
Meas. Tech.ChEMBL_611486 (CHEMBL1069468)
Ki 440±n/a nM
Citation Cole, DCGross, JLComery, TAAschmies, SHirst, WDKelley, CKim, JIKubek, KNing, XPlatt, BJRobichaud, AJSolvibile, WRStock, JRTawa, GWilliams, MJEllingboe, JW Benzimidazole- and indole-substituted 1,3'-bipyrrolidine benzamides as histamine H3 receptor antagonists. Bioorg Med Chem Lett20:1237-40 (2010) 
 
Histamine H3 receptor
Name:Histamine H3 receptor
Type:G Protein-Coupled Receptor (GPCR)
Mol. Mass.:48691.47
Organism:Homo sapiens (Human)
Description:Binding assays were using CHO cells stably expressing hH3R receptors.
Residue:445
BDBM50309840
NameBDBM50309840
Synonyms:(R)-(3-(dimethylamino)pyrrolidin-1-yl)(4-((2-phenyl-1H-benzo[d]imidazol-1-yl)methyl)phenyl)methanone | CHEMBL598352
TypeSmall organic molecule
Emp. Form.C27H28N4O
Mol. Mass.424.5374
SMILESCN(C)[C@@H]1CCN(C1)C(=O)c1ccc(Cn2c(nc3ccccc23)-c2ccccc2)cc1